{"text_format":"1","workbook":"xlsx","n_sheets":6,"sheets":["Notes","Codes","Data","Basis","Spreads","Prices"],"not_rendered":{"charts":5,"images":0,"macros":1,"external_links":0,"defined_names":24,"comments":0,"pivot_tables":0},"unopened":[],"bounds":{"document_bytes":16777216,"sheet_cells":100000,"rows_first":2000,"rows_last":500,"rows_between":2000,"halvings":0,"cell_chars":16384,"cell_head_chars":4096},"cells_cut":0,"cells_raw":0,"read":"whole","date_system":"1900"}

{"sheet":"Notes","index":0,"n_rows":0,"n_cols":0,"rows_kept":0,"cut":false,"hidden":false,"merged":[]}

{"sheet":"Codes","index":1,"n_rows":38,"n_cols":2,"rows_kept":38,"cut":false,"hidden":true,"merged":[]}
["Item","Number"]
["Minneapolis Hard Red Spring Wheat Futures",2]
["KCBT  Hard Red Winter Wheat Futures",3]
["CBOT Soft Red Winter Wheat Futures",4]
["CBOT Nearby Corn Futures",5]
["CBOT Nearby Soybean Futures",6]
["HRW Wheat Index",7]
["SRW Wheat Index",8]
["HRS Wheat Index",9]
["National Soybean Index",10]
["National Corn Index",11]
["Durum Wheat Index",12]
["Minneapolis Wheat (HRS, 13%, Rail)",13]
["Minneapolis Wheat (HRS, 13%, Truck)",14]
["Minneapolis Wheat (HRS, 14%, Rail)",15]
["Minneapolis Wheat (HRS, 14%, Truck)",16]
["Minneapolis Wheat (HRS, 15%, Rail)",17]
["Minneapolis Wheat (HRS, 15%, Truck)",18]
["Portland Wheat (HRS, 14%, Del.)",19]
["Montana Wheat (HRS, Billings, 14%)",20]
{"$rows_left_out":19}
{"sheet":"Data","index":2,"n_rows":154,"n_cols":38,"rows_kept":154,"cut":false,"hidden":true,"merged":[]}
[]
[]
[]
[]
[]
[null,null,null,null,null,null,"$CRWI","$CSWI","$CRSI","$CNSI","$CNCI","$CDWI",null,null,null,null,null,null,null,null,null,null,null,null,"NC","NE","EC",null,null,null,null,null,null,"NC"]
[null,{"$f":"COLUMN()","v":2},{"$f":"COLUMN()","v":3},{"$f":"COLUMN()","v":4},{"$f":"COLUMN()","v":5},{"$f":"COLUMN()","v":6},{"$f":"COLUMN()","v":7},{"$f":"COLUMN()","v":8},{"$f":"COLUMN()","v":9},{"$f":"COLUMN()","v":10},{"$f":"COLUMN()","v":11},{"$f":"COLUMN()","v":12},{"$f":"COLUMN()","v":13},{"$f":"COLUMN()","v":14},{"$f":"COLUMN()","v":15},{"$f":"COLUMN()","v":16},{"$f":"COLUMN()","v":17},{"$f":"COLUMN()","v":18},{"$f":"COLUMN()","v":19},{"$f":"COLUMN()","v":20},{"$f":"COLUMN()","v":21},{"$f":"COLUMN()","v":22},{"$f":"COLUMN()","v":23},{"$f":"COLUMN()","v":24},{"$f":"COLUMN()","v":25},{"$f":"COLUMN()","v":26},{"$f":"COLUMN()","v":27},{"$f":"COLUMN()","v":28},{"$f":"COLUMN()","v":29},{"$f":"COLUMN()","v":30},{"$f":"COLUMN()","v":31},{"$f":"COLUMN()","v":32},{"$f":"COLUMN()","v":33},{"$f":"COLUMN()","v":34},{"$f":"COLUMN()","v":35},{"$f":"COLUMN()","v":36},{"$f":"COLUMN()","v":37},{"$f":"COLUMN()","v":38}]
["Code","MW","KW","W","C","S","HRWI","SRWI","HRSI","NSI","NCI","DWI","Mpls13R","Mpls13T","Mpls14R","Mpls14T","Mpls15R","Mpls15T","Port14","Mont1","Mont2","Mont3","Mont4","Mont5","SD2","SD3","SD4","STL","SWIL","NOLA","TOL","KC","WKS","DEN","HOUS","CILC","CILS","NCIA"]
[null,"Minneapolis","KCBT","CBOT","CBOT","CBOT","HRW","SRW","HRS","Soybean","Corn","Durum","HRS","HRS","HRS","HRS","HRS","HRS","HRS","HRS","HRS","HRS","HRS","HRS","HRS","HRS","HRS","SRW","SRW","SRW","SRW","HRW","HRW","HRW","HRW","Corn","Soybeans","Soybeans"]
["Date","Wheat","Wheat","Wheat","Corn","Soybeans","Index","Index","Index","Index","Index","Index","13% Rail","13% Truck","14% Rail","14% Truck","15% Rail","15% Truck","14% Port.","14% Billings","14% GT","14% GF","14% NC","14% NE","14% Siss.","14% Bristol","14% Aber.","St. Louis","S.W. IL","NOLA","Toledo","KC","W. KS","Denver","Houston","Cent.IL","Cent. IL","N.C. Iowa"]
["2014-01-01",604,615.5,555.75,434,1282.75,598,534.08000000000004,616.51,1247.71,415.46,676.96,873.99999999999989,644,916.5,679,924,694,787,641.5,621,633,635,613.5,624,614,604,580,583.5,653.25,547.25,505,601,616,738,419.5,1278.5,1244]
["2014-02-01",670.75,677,599,463.5,1414.25,655.98,580.29999999999995,665.64,1370.77,435.26,667.5,918.5,701,926.25,736.25,968,751,851.25,678.5,681.5,680.5,691,660.5,686,676,656,625.5,591,711.5,597.75,556.5,661.5,668,808.5,444,1395.5,1367.5]
["2014-03-01",742.75,764,697.25,502,1464,727.6,674.57,708.62,1420.54,468.35,676.04,880.00000000000011,753,903.75,787.75,923,802.99999999999989,906.75,690.5,678.5,699.5,693.5,670.5,710,700,695,721.5,705.5,789.75,690.25,633,746.5,719,894,482.5,1462,1416]
["2014-04-01",757,809.75,713,519,1530.75,771.13,692.13,725.08,1484.44,484.04,670,874,774,878.75,808.75,939,824,905.75,726.5,694.5,739.5,739.5,696.5,749,706,701,732,709.5,784,708.5,708.25,793,777,940,496.5,1521.5,1481]
["2014-05-01",706.5,723,627.25,465.75,1493.25,683.87,600.47,665,1472.06,439.6,690.77,803.99999999999989,712,839,746.5,882,762,837.5,668.5,663.5,683,674,653.5,682,660,647,629.5,619,668.25,618.75,627.5,703.5,705.5,840.5,452,1507.5,1466.5]
["2014-06-01",667.25,710.5,564.75,425.25,1400.5,671.22,548.55999999999995,648.48,1361.96,401.6,852.65,852,687,962,727,1024.5,727,852,649.5,664.5,686,653.5,676,652,642,632,594,530.5,633.75,567.125,590,676.5,690,823,413,1393,1362.5]
["2014-07-01",616,625.75,530.25,367,1224.5,585.34,499.8,594.30999999999995,1205.27,337.13,844.13,771.00000000000011,651,816,676,1026,686,799,579.5,599.5,608.5,571.5,563.5,591,576,556,499.5,457.5,581.75,530.25,515.25,592.5,585,705.5,353.5,1254.5,1202]
["2014-08-01",615,626.25,550.25,364.75,1089.5,587.04,515.17999999999995,595.4,1179.7,339.36,835,765,615,902.25,664.75,1142.5,690,815.75,602.5,625.5,619.5,590.5,583.5,585,570,555,502,463,596.75,558,530.75,595.5,568.5,716.25,362,1237,1236.5]
["2014-09-01",533.5,558,477.75,320.75,913.25,509.85,427.97,525.36,856.56,283.64999999999998,1092.3800000000001,673,463.99999999999994,753.5,563.5,1096,588,808.5,545.5,565.5,590.5,561.5,536.5,489,484,469,326,299,547.25,477.25,432.5,518,503,628.5,282,886,853]
["2014-10-01",574.25,593.75,532.5,376.75,1046.5,551.57000000000005,493.07,580.94000000000005,985.73,335.63,1156.67,751.5,504,821.75,604.25,1099,629,919.25,652,652.5,651.5,685,615.5,539,524,519,449.5,447,633,537,458.25,554,551.5,703.75,339.5,1022,991.5]
{"$rows_left_out":135}
{"sheet":"Basis","index":3,"n_rows":62,"n_cols":15,"rows_kept":62,"cut":false,"hidden":false,"merged":[[2,9,2,13],[6,9,6,13]]}
[null,null,null,null,null,null,null,null,"Use the Drop-Down Menus in Cells L3 and L7 to select items."]
[null,null,"Use the Drop-Down Menu in Cell F4 to select item."]
[null,null,null,null,null,null,null,null,"Cash","Minneapolis Wheat (HRS, 14%, Truck)"]
[]
[null,null,null,null,null,null,null,null,"minus"]
[]
[null,{"$f":"VLOOKUP(J3,Codes!A2:B38,2,FALSE)","v":16},null,{"$f":"VLOOKUP(J7,Codes!A2:B38,2,FALSE)","v":2},null,{"$f":"J3","v":"Minneapolis Wheat (HRS, 14%, Truck)"},null,null,"Futures","Minneapolis Hard Red Spring Wheat Futures"]
[null,{"$f":"J3","v":"Minneapolis Wheat (HRS, 14%, Truck)"},null,{"$f":"J7","v":"Minneapolis Hard Red Spring Wheat Futures"},null,"minus"]
[null,null,null,null,null,{"$f":"J7","v":"Minneapolis Hard Red Spring Wheat Futures"},null,null,null,null,null,null,null,null,"2022-24"]
["Month",null,null,null,null,"Spread or Basis",null,null,"Month",2022,2023,2024,2025,null,"Average"]
[{"$f":"Data!A107","v":"2022-01-01"},{"$f":"IF(VLOOKUP(A11,Data!$A$11:$AL$154,Basis!$B$7,FALSE)=0,0,VLOOKUP(A11,Data!$A$11:$AL$154,Basis!$B$7,FALSE))","v":941.5},null,{"$f":"IF(VLOOKUP(A11,Data!$A$11:$AL$154,Basis!$D$7,FALSE)=0,0,VLOOKUP(A11,Data!$A$11:$AL$154,Basis!$D$7,FALSE))","v":906.5},null,{"$f":"IF(B11<>0, B11-D11,\"\")","v":35},null,null,"Jan.",{"$f":"IF(B11>0,F11,NA())","v":35},{"$f":"IF(B23>0,F23,NA())","v":25},{"$f":"IF(B35>0,F35,NA())","v":35},{"$f":"IF(B47>0,F47,NA())","v":10},null,{"$f":"AVERAGE(J11:L11)","v":31.666666666666668}]
[{"$f":"Data!A108","v":"2022-02-01"},{"$f":"IF(VLOOKUP(A12,Data!$A$11:$AL$154,Basis!$B$7,FALSE)=0,0,VLOOKUP(A12,Data!$A$11:$AL$154,Basis!$B$7,FALSE))","v":1034},null,{"$f":"IF(VLOOKUP(A12,Data!$A$11:$AL$154,Basis!$D$7,FALSE)=0,0,VLOOKUP(A12,Data!$A$11:$AL$154,Basis!$D$7,FALSE))","v":989},null,{"$f":"IF(B12<>0, B12-D12,\"\")","v":45},null,null,"Feb.",{"$f":"IF(B12>0,F12,NA())","v":45},{"$f":"IF(B24>0,F24,NA())","v":24},{"$f":"IF(B36>0,F36,NA())","v":29.5},{"$f":"IF(B48>0,F48,NA())","v":25.5},null,{"$f":"AVERAGE(J12:L12)","v":32.833333333333336}]
[{"$f":"Data!A109","v":"2022-03-01"},{"$f":"IF(VLOOKUP(A13,Data!$A$11:$AL$154,Basis!$B$7,FALSE)=0,0,VLOOKUP(A13,Data!$A$11:$AL$154,Basis!$B$7,FALSE))","v":1106.75},null,{"$f":"IF(VLOOKUP(A13,Data!$A$11:$AL$154,Basis!$D$7,FALSE)=0,0,VLOOKUP(A13,Data!$A$11:$AL$154,Basis!$D$7,FALSE))","v":1079.5},null,27.25,null,null,"Mar.",27.25,25,35,10,null,29.083333333333332]
[{"$f":"Data!A110","v":"2022-04-01"},{"$f":"IF(VLOOKUP(A14,Data!$A$11:$AL$154,Basis!$B$7,FALSE)=0,0,VLOOKUP(A14,Data!$A$11:$AL$154,Basis!$B$7,FALSE))","v":1196},null,{"$f":"IF(VLOOKUP(A14,Data!$A$11:$AL$154,Basis!$D$7,FALSE)=0,0,VLOOKUP(A14,Data!$A$11:$AL$154,Basis!$D$7,FALSE))","v":1161.25},null,34.75,null,null,"Apr.",34.75,25,29,-2,null,29.583333333333332]
[{"$f":"Data!A111","v":"2022-05-01"},{"$f":"IF(VLOOKUP(A15,Data!$A$11:$AL$154,Basis!$B$7,FALSE)=0,0,VLOOKUP(A15,Data!$A$11:$AL$154,Basis!$B$7,FALSE))","v":1272.5},null,{"$f":"IF(VLOOKUP(A15,Data!$A$11:$AL$154,Basis!$D$7,FALSE)=0,0,VLOOKUP(A15,Data!$A$11:$AL$154,Basis!$D$7,FALSE))","v":1247.5},null,25,null,null,"May",25,20,30,15,null,25]
[{"$f":"Data!A112","v":"2022-06-01"},{"$f":"IF(VLOOKUP(A16,Data!$A$11:$AL$154,Basis!$B$7,FALSE)=0,0,VLOOKUP(A16,Data!$A$11:$AL$154,Basis!$B$7,FALSE))","v":1022.75},null,{"$f":"IF(VLOOKUP(A16,Data!$A$11:$AL$154,Basis!$D$7,FALSE)=0,0,VLOOKUP(A16,Data!$A$11:$AL$154,Basis!$D$7,FALSE))","v":987.75},null,35,null,null,"Jne.",35,35,30,17.75,null,33.333333333333336]
[{"$f":"Data!A113","v":"2022-07-01"},{"$f":"IF(VLOOKUP(A17,Data!$A$11:$AL$154,Basis!$B$7,FALSE)=0,0,VLOOKUP(A17,Data!$A$11:$AL$154,Basis!$B$7,FALSE))","v":926},null,{"$f":"IF(VLOOKUP(A17,Data!$A$11:$AL$154,Basis!$D$7,FALSE)=0,0,VLOOKUP(A17,Data!$A$11:$AL$154,Basis!$D$7,FALSE))","v":906},null,20,null,null,"Jly.",20,-10,5,{"$error":"#N/A"},null,5]
[{"$f":"Data!A114","v":"2022-08-01"},{"$f":"IF(VLOOKUP(A18,Data!$A$11:$AL$154,Basis!$B$7,FALSE)=0,0,VLOOKUP(A18,Data!$A$11:$AL$154,Basis!$B$7,FALSE))","v":944.5},null,{"$f":"IF(VLOOKUP(A18,Data!$A$11:$AL$154,Basis!$D$7,FALSE)=0,0,VLOOKUP(A18,Data!$A$11:$AL$154,Basis!$D$7,FALSE))","v":915.5},null,29,null,null,"Aug.",29,-25,16.75,{"$error":"#N/A"},null,6.916666666666667]
[{"$f":"Data!A115","v":"2022-09-01"},{"$f":"IF(VLOOKUP(A19,Data!$A$11:$AL$154,Basis!$B$7,FALSE)=0,0,VLOOKUP(A19,Data!$A$11:$AL$154,Basis!$B$7,FALSE))","v":1007},null,{"$f":"IF(VLOOKUP(A19,Data!$A$11:$AL$154,Basis!$D$7,FALSE)=0,0,VLOOKUP(A19,Data!$A$11:$AL$154,Basis!$D$7,FALSE))","v":982},null,25,null,null,"Sep.",25,-70,10,{"$error":"#N/A"},null,-11.666666666666666]
[{"$f":"Data!A116","v":"2022-10-01"},{"$f":"IF(VLOOKUP(A20,Data!$A$11:$AL$154,Basis!$B$7,FALSE)=0,0,VLOOKUP(A20,Data!$A$11:$AL$154,Basis!$B$7,FALSE))","v":1006.25},null,{"$f":"IF(VLOOKUP(A20,Data!$A$11:$AL$154,Basis!$D$7,FALSE)=0,0,VLOOKUP(A20,Data!$A$11:$AL$154,Basis!$D$7,FALSE))","v":981.25},null,25,null,null,"Oct.",25,20,10,{"$error":"#N/A"},null,18.333333333333332]
{"$rows_left_out":43}
{"sheet":"Spreads","index":4,"n_rows":62,"n_cols":15,"rows_kept":62,"cut":false,"hidden":false,"merged":[[2,9,2,13],[6,9,6,13]]}
[null,null,null,null,null,null,null,null,"Use the Drop-Down Menus in Cells L3 and L7 to select items."]
[null,null,"Use the Drop-Down Menu in Cell F4 to select item."]
[null,null,null,null,null,null,null,null,"Futures 1","Minneapolis Hard Red Spring Wheat Futures"]
[]
[null,null,null,null,null,null,null,null,"minus"]
[]
[null,{"$f":"VLOOKUP(J3,Codes!A2:B38,2,FALSE)","v":2},null,{"$f":"VLOOKUP(J7,Codes!A2:B38,2,FALSE)","v":3},null,{"$f":"J3","v":"Minneapolis Hard Red Spring Wheat Futures"},null,null,"Futures 2","KCBT  Hard Red Winter Wheat Futures"]
[null,{"$f":"J3","v":"Minneapolis Hard Red Spring Wheat Futures"},null,{"$f":"J7","v":"KCBT  Hard Red Winter Wheat Futures"},null,"minus"]
[null,null,null,null,null,{"$f":"J7","v":"KCBT  Hard Red Winter Wheat Futures"}]
["Month",null,null,null,null,"Spread or Basis"]
[{"$f":"Data!A107","v":"2022-01-01"},{"$f":"IF(VLOOKUP(A11,Data!$A$11:$AL$154,Spreads!$B$7,FALSE)=0,\"\",VLOOKUP(A11,Data!$A$11:$AL$154,Spreads!$B$7,FALSE))","v":906.5},null,{"$f":"IF(VLOOKUP(A11,Data!$A$11:$AL$154,Spreads!$D$7,FALSE)=0,\"\",VLOOKUP(A11,Data!$A$11:$AL$154,Spreads!$D$7,FALSE))","v":781.25},null,{"$f":"IF(B11=\"\", \"\",B11-D11)","v":125.25},null,null,{"$f":"J3","v":"Minneapolis Hard Red Spring Wheat Futures"}]
[{"$f":"Data!A108","v":"2022-02-01"},{"$f":"IF(VLOOKUP(A12,Data!$A$11:$AL$154,Spreads!$B$7,FALSE)=0,\"\",VLOOKUP(A12,Data!$A$11:$AL$154,Spreads!$B$7,FALSE))","v":989},null,{"$f":"IF(VLOOKUP(A12,Data!$A$11:$AL$154,Spreads!$D$7,FALSE)=0,\"\",VLOOKUP(A12,Data!$A$11:$AL$154,Spreads!$D$7,FALSE))","v":954.25},null,{"$f":"IF(B12=\"\", \"\",B12-D12)","v":34.75},null,null,"minus"]
[{"$f":"Data!A109","v":"2022-03-01"},{"$f":"IF(VLOOKUP(A13,Data!$A$11:$AL$154,Spreads!$B$7,FALSE)=0,\"\",VLOOKUP(A13,Data!$A$11:$AL$154,Spreads!$B$7,FALSE))","v":1079.5},null,{"$f":"IF(VLOOKUP(A13,Data!$A$11:$AL$154,Spreads!$D$7,FALSE)=0,\"\",VLOOKUP(A13,Data!$A$11:$AL$154,Spreads!$D$7,FALSE))","v":1130.5},null,-51,null,null,{"$f":"J7","v":"KCBT  Hard Red Winter Wheat Futures"}]
[{"$f":"Data!A110","v":"2022-04-01"},{"$f":"IF(VLOOKUP(A14,Data!$A$11:$AL$154,Spreads!$B$7,FALSE)=0,\"\",VLOOKUP(A14,Data!$A$11:$AL$154,Spreads!$B$7,FALSE))","v":1161.25},null,{"$f":"IF(VLOOKUP(A14,Data!$A$11:$AL$154,Spreads!$D$7,FALSE)=0,\"\",VLOOKUP(A14,Data!$A$11:$AL$154,Spreads!$D$7,FALSE))","v":1094.25},null,67,null,null,"Futures Spread"]
[{"$f":"Data!A111","v":"2022-05-01"},{"$f":"IF(VLOOKUP(A15,Data!$A$11:$AL$154,Spreads!$B$7,FALSE)=0,\"\",VLOOKUP(A15,Data!$A$11:$AL$154,Spreads!$B$7,FALSE))","v":1247.5},null,{"$f":"IF(VLOOKUP(A15,Data!$A$11:$AL$154,Spreads!$D$7,FALSE)=0,\"\",VLOOKUP(A15,Data!$A$11:$AL$154,Spreads!$D$7,FALSE))","v":1165.5},null,82,null,null,null,null,null,null,null,null,"2022-24"]
[{"$f":"Data!A112","v":"2022-06-01"},{"$f":"IF(VLOOKUP(A16,Data!$A$11:$AL$154,Spreads!$B$7,FALSE)=0,\"\",VLOOKUP(A16,Data!$A$11:$AL$154,Spreads!$B$7,FALSE))","v":987.75},null,{"$f":"IF(VLOOKUP(A16,Data!$A$11:$AL$154,Spreads!$D$7,FALSE)=0,\"\",VLOOKUP(A16,Data!$A$11:$AL$154,Spreads!$D$7,FALSE))","v":948.75},null,39,null,null,"Month",2022,2023,2024,2025,null,"Average"]
[{"$f":"Data!A113","v":"2022-07-01"},{"$f":"IF(VLOOKUP(A17,Data!$A$11:$AL$154,Spreads!$B$7,FALSE)=0,\"\",VLOOKUP(A17,Data!$A$11:$AL$154,Spreads!$B$7,FALSE))","v":906},null,{"$f":"IF(VLOOKUP(A17,Data!$A$11:$AL$154,Spreads!$D$7,FALSE)=0,\"\",VLOOKUP(A17,Data!$A$11:$AL$154,Spreads!$D$7,FALSE))","v":874.5},null,31.5,null,null,"Jan.",{"$f":"IF(F11=\"\",NA(),F11)","v":125.25},{"$f":"IF(F23=\"\",NA(),F23)","v":43.5},{"$f":"IF(F35=\"\",NA(),F35)","v":81.75},{"$f":"IF(F47=\"\",NA(),F47)","v":36.25},null,{"$f":"AVERAGE(J17:L17)","v":83.5}]
[{"$f":"Data!A114","v":"2022-08-01"},{"$f":"IF(VLOOKUP(A18,Data!$A$11:$AL$154,Spreads!$B$7,FALSE)=0,\"\",VLOOKUP(A18,Data!$A$11:$AL$154,Spreads!$B$7,FALSE))","v":915.5},null,{"$f":"IF(VLOOKUP(A18,Data!$A$11:$AL$154,Spreads!$D$7,FALSE)=0,\"\",VLOOKUP(A18,Data!$A$11:$AL$154,Spreads!$D$7,FALSE))","v":924.25},null,-8.75,null,null,"Feb.",34.75,55,61.75,24,null,50.5]
[{"$f":"Data!A115","v":"2022-09-01"},{"$f":"IF(VLOOKUP(A19,Data!$A$11:$AL$154,Spreads!$B$7,FALSE)=0,\"\",VLOOKUP(A19,Data!$A$11:$AL$154,Spreads!$B$7,FALSE))","v":982},null,{"$f":"IF(VLOOKUP(A19,Data!$A$11:$AL$154,Spreads!$D$7,FALSE)=0,\"\",VLOOKUP(A19,Data!$A$11:$AL$154,Spreads!$D$7,FALSE))","v":991.5},null,-9.5,null,null,"Mar.",-51,18,18.5,35,null,-4.833333333333333]
[{"$f":"Data!A116","v":"2022-10-01"},{"$f":"IF(VLOOKUP(A20,Data!$A$11:$AL$154,Spreads!$B$7,FALSE)=0,\"\",VLOOKUP(A20,Data!$A$11:$AL$154,Spreads!$B$7,FALSE))","v":981.25},null,{"$f":"IF(VLOOKUP(A20,Data!$A$11:$AL$154,Spreads!$D$7,FALSE)=0,\"\",VLOOKUP(A20,Data!$A$11:$AL$154,Spreads!$D$7,FALSE))","v":924},null,57.25,null,null,"Apr.",67,-19.25,87.5,99.75,null,45.083333333333336]
{"$rows_left_out":43}
{"sheet":"Prices","index":5,"n_rows":62,"n_cols":14,"rows_kept":62,"cut":false,"hidden":false,"merged":[[2,8,2,12],[6,8,6,12]]}
[null,null,null,null,null,null,null,"Use the Drop-Down Menus in Cells L3 and L7 to select items."]
[null,null,"Use the Drop-Down Menu in Cell F4 to select item."]
[null,null,null,null,null,null,null,"Price 1","Minneapolis Hard Red Spring Wheat Futures"]
[]
[null,null,null,null,null,null,null,"minus"]
[]
[null,{"$f":"VLOOKUP(I3,Codes!A2:B38,2,FALSE)","v":2},null,{"$f":"VLOOKUP(I7,Codes!A2:B38,2,FALSE)","v":3},null,null,null,"Price 2","KCBT  Hard Red Winter Wheat Futures"]
[null,{"$f":"I3","v":"Minneapolis Hard Red Spring Wheat Futures"},null,{"$f":"I7","v":"KCBT  Hard Red Winter Wheat Futures"}]
[]
["Month",null,null,null,null,null,null,{"$f":"I3","v":"Minneapolis Hard Red Spring Wheat Futures"}]
[{"$f":"Data!A107","v":"2022-01-01"},{"$f":"IF(VLOOKUP(A11,Data!$A$11:$AL$154,Prices!$B$7,FALSE)=0,\"\",VLOOKUP(A11,Data!$A$11:$AL$154,Prices!$B$7,FALSE))","v":906.5},null,{"$f":"IF(VLOOKUP(A11,Data!$A$11:$AL$154,Prices!$D$7,FALSE)=0,\"\",VLOOKUP(A11,Data!$A$11:$AL$154,Prices!$D$7,FALSE))","v":781.25},null,null,null,null,null,null,null,null,null,"2022-24"]
[{"$f":"Data!A108","v":"2022-02-01"},{"$f":"IF(VLOOKUP(A12,Data!$A$11:$AL$154,Prices!$B$7,FALSE)=0,\"\",VLOOKUP(A12,Data!$A$11:$AL$154,Prices!$B$7,FALSE))","v":989},null,{"$f":"IF(VLOOKUP(A12,Data!$A$11:$AL$154,Prices!$D$7,FALSE)=0,\"\",VLOOKUP(A12,Data!$A$11:$AL$154,Prices!$D$7,FALSE))","v":954.25},null,null,null,"Month",2022,2023,2024,2025,null,"Average"]
[{"$f":"Data!A109","v":"2022-03-01"},{"$f":"IF(VLOOKUP(A13,Data!$A$11:$AL$154,Prices!$B$7,FALSE)=0,\"\",VLOOKUP(A13,Data!$A$11:$AL$154,Prices!$B$7,FALSE))","v":1079.5},null,{"$f":"IF(VLOOKUP(A13,Data!$A$11:$AL$154,Prices!$D$7,FALSE)=0,\"\",VLOOKUP(A13,Data!$A$11:$AL$154,Prices!$D$7,FALSE))","v":1130.5},null,null,null,"Jan.",{"$f":"IF(B11=\"\",NA(),B11)","v":906.5},{"$f":"IF(B23=\"\",NA(),B23)","v":922.25},{"$f":"IF(B35=\"\",NA(),B35)","v":692.25},{"$f":"IF(B47=\"\",NA(),B47)","v":615.5},null,{"$f":"AVERAGE(I13:K13)","v":840.33333333333337}]
[{"$f":"Data!A110","v":"2022-04-01"},{"$f":"IF(VLOOKUP(A14,Data!$A$11:$AL$154,Prices!$B$7,FALSE)=0,\"\",VLOOKUP(A14,Data!$A$11:$AL$154,Prices!$B$7,FALSE))","v":1161.25},null,{"$f":"IF(VLOOKUP(A14,Data!$A$11:$AL$154,Prices!$D$7,FALSE)=0,\"\",VLOOKUP(A14,Data!$A$11:$AL$154,Prices!$D$7,FALSE))","v":1094.25},null,null,null,"Feb.",989,870.75,664.5,582.25,null,{"$f":"AVERAGE(I14:K14)","v":841.41666666666663}]
[{"$f":"Data!A111","v":"2022-05-01"},{"$f":"IF(VLOOKUP(A15,Data!$A$11:$AL$154,Prices!$B$7,FALSE)=0,\"\",VLOOKUP(A15,Data!$A$11:$AL$154,Prices!$B$7,FALSE))","v":1247.5},null,{"$f":"IF(VLOOKUP(A15,Data!$A$11:$AL$154,Prices!$D$7,FALSE)=0,\"\",VLOOKUP(A15,Data!$A$11:$AL$154,Prices!$D$7,FALSE))","v":1165.5},null,null,null,"Mar.",1079.5,895.75,645,592,null,873.41666666666663]
[{"$f":"Data!A112","v":"2022-06-01"},{"$f":"IF(VLOOKUP(A16,Data!$A$11:$AL$154,Prices!$B$7,FALSE)=0,\"\",VLOOKUP(A16,Data!$A$11:$AL$154,Prices!$B$7,FALSE))","v":987.75},null,{"$f":"IF(VLOOKUP(A16,Data!$A$11:$AL$154,Prices!$D$7,FALSE)=0,\"\",VLOOKUP(A16,Data!$A$11:$AL$154,Prices!$D$7,FALSE))","v":948.75},null,null,null,"Apr.",1161.25,788,710.25,614,null,886.5]
[{"$f":"Data!A113","v":"2022-07-01"},{"$f":"IF(VLOOKUP(A17,Data!$A$11:$AL$154,Prices!$B$7,FALSE)=0,\"\",VLOOKUP(A17,Data!$A$11:$AL$154,Prices!$B$7,FALSE))","v":906},null,{"$f":"IF(VLOOKUP(A17,Data!$A$11:$AL$154,Prices!$D$7,FALSE)=0,\"\",VLOOKUP(A17,Data!$A$11:$AL$154,Prices!$D$7,FALSE))","v":874.5},null,null,null,"May",1247.5,780,739.75,625.5,null,922.41666666666663]
[{"$f":"Data!A114","v":"2022-08-01"},{"$f":"IF(VLOOKUP(A18,Data!$A$11:$AL$154,Prices!$B$7,FALSE)=0,\"\",VLOOKUP(A18,Data!$A$11:$AL$154,Prices!$B$7,FALSE))","v":915.5},null,{"$f":"IF(VLOOKUP(A18,Data!$A$11:$AL$154,Prices!$D$7,FALSE)=0,\"\",VLOOKUP(A18,Data!$A$11:$AL$154,Prices!$D$7,FALSE))","v":924.25},null,null,null,"Jne.",987.75,802,613,603,null,800.91666666666663]
[{"$f":"Data!A115","v":"2022-09-01"},{"$f":"IF(VLOOKUP(A19,Data!$A$11:$AL$154,Prices!$B$7,FALSE)=0,\"\",VLOOKUP(A19,Data!$A$11:$AL$154,Prices!$B$7,FALSE))","v":982},null,{"$f":"IF(VLOOKUP(A19,Data!$A$11:$AL$154,Prices!$D$7,FALSE)=0,\"\",VLOOKUP(A19,Data!$A$11:$AL$154,Prices!$D$7,FALSE))","v":991.5},null,null,null,"Jly.",906,855.75,581.5,{"$error":"#N/A"},null,781.08333333333337]
[{"$f":"Data!A116","v":"2022-10-01"},{"$f":"IF(VLOOKUP(A20,Data!$A$11:$AL$154,Prices!$B$7,FALSE)=0,\"\",VLOOKUP(A20,Data!$A$11:$AL$154,Prices!$B$7,FALSE))","v":981.25},null,{"$f":"IF(VLOOKUP(A20,Data!$A$11:$AL$154,Prices!$D$7,FALSE)=0,\"\",VLOOKUP(A20,Data!$A$11:$AL$154,Prices!$D$7,FALSE))","v":924},null,null,null,"Aug.",915.5,735,573.75,{"$error":"#N/A"},null,741.41666666666663]
{"$rows_left_out":42}